Reaction Details
TargetPotassium voltage-gated channel subfamily H member 2
LigandBDBM50117922
Substrate/Competitorn/a
Meas. Tech.ChEMBL_538846 (CHEMBL1033089)
IC50 806±n/a nM
Citation Yang, ZQBarrow, JCShipe, WDSchlegel, KAShu, YYang, FVLindsley, CWRittle, KEBock, MGHartman, GDUebele, VNNuss, CEFox, SVKraus, RLDoran, SMConnolly, TMTang, CBallard, JEKuo, YAdarayan, EDPrueksaritanont, TZrada, MMMarino, MJGraufelds, VKDiLella, AGReynolds, IJVargas, HMBunting, PBWoltmann, RFMagee, MMKoblan, KSRenger, JJ Discovery of 1,4-substituted piperidines as potent and selective inhibitors of T-type calcium channels. J Med Chem51:6471-7 (2008) 
 
Potassium voltage-gated channel subfamily H member 2
Name:Potassium voltage-gated channel subfamily H member 2
Type:Multi-pass membrane protein
Mol. Mass.:126672.65
Organism:Homo sapiens (Human)
Description:Q12809
Residue:1159
BDBM50117922
NameBDBM50117922
Synonyms:(1S,2S)-2-(2-((3-(1H-benzo[d]imidazol-2-yl)propyl)(methyl)amino)ethyl)-6-fluoro-1-isopropyl-1,2,3,4-tetrahydronaphthalen-2-yl 2-methoxyacetate CHEMBL45816 Methoxy-acetic acid (1S,2S)-2-(2-{[3-(1H-benzoimidazol-2-yl)-propyl]-methyl-amino}-ethyl)-6-fluoro-1-isopropyl-1,2,3,4-tetrahydro-naphthalen-2-yl ester Mibefradil dihydrochloride
TypeSmall organic molecule
Emp. Form.C29H38FN3O3
Mol. Mass.495.6287
SMILESCOCC(=O)O[C@]1(CCN(C)CCCc2nc3ccccc3[nH]2)CCc2cc(F)ccc2[C@@H]1C(C)C