Reaction Details
TargetTyrosine-protein kinase Lyn
LigandBDBM50274001
Substrate/Competitorn/a
Meas. Tech.ChEMBL_537173 (CHEMBL992549)
IC50>10000±n/a nM
Citation Moriarty, KJWinters, MQiao, LRyan, DDesJarlis, RRobinson, DCook, BNKashem, MAKaplita, PVLiu, LHFarrell, TMKhine, HHKing, JPullen, SSRoth, GPMagolda, RTakahashi, H Itk kinase inhibitors: initial efforts to improve the metabolical stability and the cell activity of the benzimidazole lead. Bioorg Med Chem Lett18:5537-40 (2008) 
 
Tyrosine-protein kinase Lyn
Name:Tyrosine-protein kinase Lyn
Type:Protein
Mol. Mass.:58575.92
Organism:Homo sapiens (Human)
Description:P07948
Residue:512
BDBM50274001
NameBDBM50274001
Synonyms:CHEMBL462301 | N-[5-(Benzoyl-ethyl-amino)-1-(2-carbamoyl-ethyl)-1H-benzoimidazol-2-yl]-4-cyano-benzamide
TypeSmall organic molecule
Emp. Form.C27H24N6O3
Mol. Mass.480.5179
SMILESCCN(C(=O)c1ccccc1)c1ccc2n(CCC(N)=O)c(NC(=O)c3ccc(cc3)C#N)nc2c1