Reaction Details
TargetTyrosine-protein kinase Tec
LigandBDBM26812
Substrate/Competitorn/a
Meas. Tech.ChEMBL_537174 (CHEMBL992550)
IC50>10000±n/a nM
Citation Moriarty, KJWinters, MQiao, LRyan, DDesJarlis, RRobinson, DCook, BNKashem, MAKaplita, PVLiu, LHFarrell, TMKhine, HHKing, JPullen, SSRoth, GPMagolda, RTakahashi, H Itk kinase inhibitors: initial efforts to improve the metabolical stability and the cell activity of the benzimidazole lead. Bioorg Med Chem Lett18:5537-40 (2008) 
 
Tyrosine-protein kinase Tec
Name:Tyrosine-protein kinase Tec
Type:Protein
Mol. Mass.:73597.00
Organism:Homo sapiens (Human)
Description:n/a
Residue:631
BDBM26812
NameBDBM26812
Synonyms:CHEMBL485203 acylated 2-aminobenzimidazole, 6
TypeSmall organic molecule
Emp. Form.C25H22ClN5O3
Mol. Mass.475.927
SMILESCN(C(=O)c1ccccc1)c1ccc2n(CCC(N)=O)c(NC(=O)c3ccc(Cl)cc3)nc2c1