Reaction Details
TargetTyrosine-protein kinase Lyn
LigandBDBM50274669
Substrate/Competitorn/a
Meas. Tech.ChEMBL_537189 (CHEMBL992565)
IC50>1000000±n/a nM
Citation Moriarty, KJTakahashi, HPullen, SSKhine, HHSallati, RHRaymond, ELWoska, JRJeanfavre, DDRoth, GPWinters, MPQiao, LRyan, DDesJarlais, RRobinson, DWilson, MBobko, MCook, BNLo, HYNemoto, PAKashem, MAWolak, JPWhite, AMagolda, RLTomczuk, B Discovery, SAR and X-ray structure of 1H-benzimidazole-5-carboxylic acid cyclohexyl-methyl-amides as inhibitors of inducible T-cell kinase (Itk). Bioorg Med Chem Lett18:5545-9 (2008) 
 
Tyrosine-protein kinase Lyn
Name:Tyrosine-protein kinase Lyn
Type:Protein
Mol. Mass.:58575.92
Organism:Homo sapiens (Human)
Description:P07948
Residue:512
BDBM50274669
NameBDBM50274669
Synonyms:CHEMBL485031 | N-(1-(3-(1H-imidazol-1-yl)propyl)-5-(N-methylcyclohexanecarboxamido)-1H-benzo[d]imidazol-2-yl)-4-cyanobenzamide
TypeSmall organic molecule
Emp. Form.C29H31N7O2
Mol. Mass.509.6021
SMILESCN(C(=O)C1CCCCC1)c1ccc2n(CCCn3ccnc3)c(NC(=O)c3ccc(cc3)C#N)nc2c1