Reaction Details
TargetTyrosine-protein kinase ITK/TSK
LigandBDBM50275692
Substrate/Competitorn/a
Meas. Tech.ChEMBL_497468 (CHEMBL1006237)
IC50 3±n/a nM
Citation Winters, MPRobinson, DJKhine, HHPullen, SSWoska, JRRaymond, ELSellati, RCywin, CLSnow, RJKashem, MAWolak, JPKing, JKaplita, PVLiu, LHFarrell, TMDesJarlais, RRoth, GPTakahashi, HMoriarty, KJ 5-Aminomethyl-1H-benzimidazoles as orally active inhibitors of inducible T-cell kinase (Itk). Bioorg Med Chem Lett18:5541-4 (2008) 
 
Tyrosine-protein kinase ITK/TSK
Name:Tyrosine-protein kinase ITK/TSK
Type:Protein
Mol. Mass.:71839.20
Organism:Homo sapiens (Human)
Description:Q08881
Residue:620
BDBM50275692
NameBDBM50275692
Synonyms:CHEMBL528989 | N-(1-(3-methoxypropyl)-5-((phenylamino)methyl)-1H-benzo[d]imidazol-2-yl)isoxazole-5-carboxamide
TypeSmall organic molecule
Emp. Form.C22H23N5O3
Mol. Mass.405.4497
SMILESCOCCCn1c(NC(=O)c2ccno2)nc2cc(CNc3ccccc3)ccc12