Reaction Details
TargetCannabinoid receptor 1
LigandBDBM50274180
Substrate/Competitorn/a
Meas. Tech.ChEMBL_537917 (CHEMBL982704)
Ki 6000±n/a nM
Citation Ortar, GBisogno, TLigresti, AMorera, ENalli, MDi Marzo, V Tetrahydrolipstatin analogues as modulators of endocannabinoid 2-arachidonoylglycerol metabolism. J Med Chem51:6970-9 (2008) 
 
Cannabinoid receptor 1
Name:Cannabinoid receptor 1
Type:G Protein-Coupled Receptor (GPCR)
Mol. Mass.:52868.96
Organism:Homo sapiens (Human)
Description:P21554
Residue:472
BDBM50274180
NameBDBM50274180
Synonyms:CHEMBL521157 | N-Formyl-L-isoleucine-(1S)-1-[[(2S,3S)-3-hexyl-4-oxo-2-oxetanyl]methyl]dodecyl Ester
TypeSmall organic molecule
Emp. Form.C29H53NO5
Mol. Mass.495.7348
SMILESCCCCCCCCCCC[C@@H](C[C@@H]1OC(=O)[C@H]1CCCCCC)OC(=O)[C@@H](NC=O)C(C)CC