Reaction Details
TargetFatty-acid amide hydrolase 1 [30-579]
LigandBDBM50274722
Substrate/Competitorn/a
Meas. Tech.ChEMBL_537919 (CHEMBL982706)
IC50>50000±n/a nM
Citation Ortar, GBisogno, TLigresti, AMorera, ENalli, MDi Marzo, V Tetrahydrolipstatin analogues as modulators of endocannabinoid 2-arachidonoylglycerol metabolism. J Med Chem51:6970-9 (2008) 
 
Fatty-acid amide hydrolase 1 [30-579]
Name:Fatty-acid amide hydrolase 1 [30-579]
Type:Single-pass membrane protein; homodimer
Mol. Mass.:60474.00
Organism:Rattus norvegicus (rat)
Description:P97612 (aa 30-579)
Residue:550
BDBM50274722
NameBDBM50274722
Synonyms:(3S,4S)-3-Hexyl-4-[(2S)-2-hydroxytridecyl]oxetan-2-one | CHEMBL458972
TypeSmall organic molecule
Emp. Form.C22H42O3
Mol. Mass.354.5671
SMILESCCCCCCCCCCC[C@H](O)C[C@@H]1OC(=O)[C@H]1CCCCCC