Reaction Details
TargetFatty-acid amide hydrolase 1 [30-579]
LigandBDBM50274777
Substrate/Competitorn/a
Meas. Tech.ChEMBL_537919 (CHEMBL982706)
IC50>50000±n/a nM
Citation Ortar, GBisogno, TLigresti, AMorera, ENalli, MDi Marzo, V Tetrahydrolipstatin analogues as modulators of endocannabinoid 2-arachidonoylglycerol metabolism. J Med Chem51:6970-9 (2008) 
 
Fatty-acid amide hydrolase 1 [30-579]
Name:Fatty-acid amide hydrolase 1 [30-579]
Type:Single-pass membrane protein; homodimer
Mol. Mass.:60474.00
Organism:Rattus norvegicus (rat)
Description:P97612 (aa 30-579)
Residue:550
BDBM50274777
NameBDBM50274777
Synonyms:CHEMBL451312 | N-[(Phenylmethoxy)carbonyl]-D-Leucine-(1S)-1-[[(2S,3S)-3-hexyl-4-oxo-2-oxetanyl]methyl]dodecyl Ester
TypeSmall organic molecule
Emp. Form.C36H59NO6
Mol. Mass.601.8568
SMILESCCCCCCCCCCC[C@@H](C[C@@H]1OC(=O)[C@H]1CCCCCC)OC(=O)[C@@H](CC(C)C)NC(=O)OCc1ccccc1