Reaction Details
TargetDiacylglycerol lipase-alpha
LigandBDBM50274778
Substrate/Competitorn/a
Meas. Tech.ChEMBL_537915 (CHEMBL982702)
IC50>25000±n/a nM
Citation Ortar, GBisogno, TLigresti, AMorera, ENalli, MDi Marzo, V Tetrahydrolipstatin analogues as modulators of endocannabinoid 2-arachidonoylglycerol metabolism. J Med Chem51:6970-9 (2008) 
 
Diacylglycerol lipase-alpha
Name:Diacylglycerol lipase-alpha
Type:PROTEIN
Mol. Mass.:114947.74
Organism:Homo sapiens (Human)
Description:ChEMBL_1449471
Residue:1042
BDBM50274778
NameBDBM50274778
Synonyms:4-Methylpentanoic Acid (1S)-1-[[(2S,3S-3-Hexyl-4-oxo-2-oxetanyl]methyl]dodecyl Ester | CHEMBL458108
TypeSmall organic molecule
Emp. Form.C28H52O4
Mol. Mass.452.7101
SMILESCCCCCCCCCCC[C@@H](C[C@@H]1OC(=O)[C@H]1CCCCCC)OC(=O)CCC(C)C