Reaction Details
TargetEstrogen receptor
LigandBDBM50275965
Substrate/Competitorn/a
Meas. Tech.ChEMBL_492826 (CHEMBL940315)
IC50 14±n/a nM
Citation Barrett, IMeegan, MJHughes, RBCarr, MKnox, AJArtemenko, NGolfis, GZisterer, DMLloyd, DG Synthesis, biological evaluation, structural-activity relationship, and docking study for a series of benzoxepin-derived estrogen receptor modulators. Bioorg Med Chem16:9554-73 (2008) 
 
Estrogen receptor
Name:Estrogen receptor
Type:Protein
Mol. Mass.:66230.44
Organism:Homo sapiens (Human)
Description:P03372
Residue:595
BDBM50275965
NameBDBM50275965
Synonyms:3-{8-Fluoro-5-[4-(2-pyrrolidin-1-yl-ethoxy)-phenyl]-2,3-dihydro-benzo[b]oxepin-4-yl}-phenol | CHEMBL471627
TypeSmall organic molecule
Emp. Form.C28H28FNO3
Mol. Mass.445.5252
SMILESOc1cccc(c1)C1=C(c2ccc(OCCN3CCCC3)cc2)c2ccc(F)cc2OCC1