Reaction Details
TargetEstrogen receptor beta
LigandBDBM50275919
Substrate/Competitorn/a
Meas. Tech.ChEMBL_492827 (CHEMBL940316)
IC50 31±n/a nM
Citation Barrett, IMeegan, MJHughes, RBCarr, MKnox, AJArtemenko, NGolfis, GZisterer, DMLloyd, DG Synthesis, biological evaluation, structural-activity relationship, and docking study for a series of benzoxepin-derived estrogen receptor modulators. Bioorg Med Chem16:9554-73 (2008) 
 
Estrogen receptor beta
Name:Estrogen receptor beta
Type:Protein
Mol. Mass.:59238.43
Organism:Homo sapiens (Human)
Description:Q92731
Residue:530
BDBM50275919
NameBDBM50275919
Synonyms:1-{2-[4-(8-Fluoro-4-phenyl-2,3-dihydro-benzo[b]oxepin-5-yl)-phenoxy]-ethyl}-pyrrolidine | CHEMBL469512
TypeSmall organic molecule
Emp. Form.C28H28FNO2
Mol. Mass.429.5258
SMILESFc1ccc2c(OCCC(c3ccccc3)=C2c2ccc(OCCN3CCCC3)cc2)c1