Reaction Details
TargetApoptosis regulator Bcl-2
LigandBDBM50274326
Substrate/Competitorn/a
Meas. Tech.ChEMBL_537290 (CHEMBL985386)
Ki 2.4±n/a nM
Citation Park, CMBruncko, MAdickes, JBauch, JDing, HKunzer, AMarsh, KCNimmer, PShoemaker, ARSong, XTahir, SKTse, CWang, XWendt, MDYang, XZhang, HFesik, SWRosenberg, SHElmore, SW Discovery of an orally bioavailable small molecule inhibitor of prosurvival B-cell lymphoma 2 proteins. J Med Chem51:6902-15 (2008) 
 
Apoptosis regulator Bcl-2
Name:Apoptosis regulator Bcl-2
Type:Homodimer or heterodimer
Mol. Mass.:26269.11
Organism:Homo sapiens (Human)
Description:P10415
Residue:239
BDBM50274326
NameBDBM50274326
Synonyms:(R)-4-(4-((4-(4-Chlorophenyl)-5,6-dihydro-2H-pyran-3-yl)methyl)piperazin-1-yl)-N-(4-(4-(dimethylamino)-1-(phenylthio)butan-2-ylamino)-3-nitrophenylsulfonyl)benzamide | CHEMBL452892
TypeSmall organic molecule
Emp. Form.C41H47ClN6O6S2
Mol. Mass.819.431
SMILESCN(C)CC[C@H](CSc1ccccc1)Nc1ccc(cc1[N+]([O-])=O)S(=O)(=O)NC(=O)c1ccc(cc1)N1CCN(CC2=C(CCOC2)c2ccc(Cl)cc2)CC1