Reaction Details
TargetBone morphogenetic protein 1
LigandBDBM50241177
Substrate/Competitorn/a
Meas. Tech.ChEMBL_518957 (CHEMBL941545)
IC50 10±n/a nM
Citation Bailey, SFish, PVBillotte, SBordner, JGreiling, DJames, KMcElroy, AMills, JEReed, CWebster, R Succinyl hydroxamates as potent and selective non-peptidic inhibitors of procollagen C-proteinase: design, synthesis, and evaluation as topically applied, dermal anti-scarring agents. Bioorg Med Chem Lett18:6562-7 (2008) 
 
Bone morphogenetic protein 1
Name:Bone morphogenetic protein 1
Type:PROTEIN
Mol. Mass.:111254.03
Organism:Homo sapiens (Human)
Description:ChEMBL_518962
Residue:986
BDBM50241177
NameBDBM50241177
Synonyms:(R)-5-(6-cyclohexyl-1-(hydroxyamino)-1-oxohexan-3-yl)-N,N-dimethyl-1,2,4-oxadiazole-3-carboxamide CHEMBL226686
TypeSmall organic molecule
Emp. Form.C17H28N4O4
Mol. Mass.352.4286
SMILESCN(C)C(=O)c1noc(n1)[C@H](CCCC1CCCCC1)CC(=O)NO