Reaction Details
TargetCalcitonin gene-related peptide type 1 receptor
LigandBDBM50246177
Substrate/Competitorn/a
Meas. Tech.ChEMBL_558102 (CHEMBL956592)
Ki 23±n/a nM
Citation Theberge, CRBednar, RABell, IMCorcoran, HAFay, JFHershey, JCJohnston, VKKane, SAMosser, SSalvatore, CAWilliams, TMZartman, CBZhang, XFGraham, SLVacca, JP Potent benzimidazolone-based CGRP receptor antagonists. Bioorg Med Chem Lett18:6122-5 (2008) 
 
Calcitonin gene-related peptide type 1 receptor
Name:Calcitonin gene-related peptide type 1 receptor
Type:Enzyme Catalytic Domain
Mol. Mass.:52980.45
Organism:Homo sapiens (Human)
Description:Q16602
Residue:461
BDBM50246177
NameBDBM50246177
Synonyms:(R)-N-(3-methyl-2,5-dioxo-1',3'-dihydrospiro[imidazolidine-4,2'-indene]-5'-yl)-2-(6-methyl-2-oxo-2,3-dihydro-1H-benzo[d]imidazol-1-yl)acetamide | CHEMBL487077
TypeSmall organic molecule
Emp. Form.C22H21N5O4
Mol. Mass.419.4332
SMILESCN1C(=O)NC(=O)[C@]11Cc2ccc(NC(=O)Cn3c4cc(C)ccc4[nH]c3=O)cc2C1