Reaction Details
TargetCalcitonin gene-related peptide type 1 receptor
LigandBDBM50246272
Substrate/Competitorn/a
Meas. Tech.ChEMBL_558102 (CHEMBL956592)
Ki 21±n/a nM
Citation Theberge, CRBednar, RABell, IMCorcoran, HAFay, JFHershey, JCJohnston, VKKane, SAMosser, SSalvatore, CAWilliams, TMZartman, CBZhang, XFGraham, SLVacca, JP Potent benzimidazolone-based CGRP receptor antagonists. Bioorg Med Chem Lett18:6122-5 (2008) 
 
Calcitonin gene-related peptide type 1 receptor
Name:Calcitonin gene-related peptide type 1 receptor
Type:Enzyme Catalytic Domain
Mol. Mass.:52980.45
Organism:Homo sapiens (Human)
Description:Q16602
Residue:461
BDBM50246272
NameBDBM50246272
Synonyms:(S)-methyl 2-(5,7-dimethyl-3-(2-((R)-3-methyl-2,5-dioxo-1',3'-dihydrospiro[imidazolidine-4,2'-indene]-5'-ylamino)-2-oxoethyl)-2-oxo-2,3-dihydro-1H-benzo[d]imidazol-1-yl)propanoate | CHEMBL488255
TypeSmall organic molecule
Emp. Form.C27H29N5O6
Mol. Mass.519.5491
SMILESCOC(=O)[C@H](C)n1c2c(C)cc(C)cc2n(CC(=O)Nc2ccc3C[C@]4(Cc3c2)N(C)C(=O)NC4=O)c1=O