Reaction Details
TargetHistamine H3 receptor
LigandBDBM50246382
Substrate/Competitorn/a
Meas. Tech.ChEMBL_558277 (CHEMBL956577)
IC50 0.18±n/a nM
Citation Mizutani, TNagase, TIto, SMiyamoto, YTanaka, TTakenaga, NTokita, SSato, N Development of novel 2-[4-(aminoalkoxy)phenyl]-4(3H)-quinazolinone derivatives as potent and selective histamine H3 receptor inverse agonists. Bioorg Med Chem Lett18:6041-5 (2008) 
 
Histamine H3 receptor
Name:Histamine H3 receptor
Type:G Protein-Coupled Receptor (GPCR)
Mol. Mass.:48691.47
Organism:Homo sapiens (Human)
Description:Binding assays were using CHO cells stably expressing hH3R receptors.
Residue:445
BDBM50246382
NameBDBM50246382
Synonyms:8-chloro-2-(4-(1-cyclobutylpiperidin-4-yloxy)phenyl)-3-methylquinazolin-4(3H)-one | CHEMBL453893
TypeSmall organic molecule
Emp. Form.C24H26ClN3O2
Mol. Mass.423.935
SMILESCn1c(nc2c(Cl)cccc2c1=O)-c1ccc(OC2CCN(CC2)C2CCC2)cc1