Reaction Details
TargetHistamine H3 receptor
LigandBDBM50246333
Substrate/Competitorn/a
Meas. Tech.ChEMBL_558277 (CHEMBL956577)
IC50 0.31±n/a nM
Citation Mizutani, TNagase, TIto, SMiyamoto, YTanaka, TTakenaga, NTokita, SSato, N Development of novel 2-[4-(aminoalkoxy)phenyl]-4(3H)-quinazolinone derivatives as potent and selective histamine H3 receptor inverse agonists. Bioorg Med Chem Lett18:6041-5 (2008) 
 
Histamine H3 receptor
Name:Histamine H3 receptor
Type:G Protein-Coupled Receptor (GPCR)
Mol. Mass.:48691.47
Organism:Homo sapiens (Human)
Description:Binding assays were using CHO cells stably expressing hH3R receptors.
Residue:445
BDBM50246333
NameBDBM50246333
Synonyms:2-(4-(1-cyclobutylpiperidin-4-yloxy)phenyl)-6-methoxy-3-methylquinazolin-4(3H)-one | CHEMBL453654
TypeSmall organic molecule
Emp. Form.C25H29N3O3
Mol. Mass.419.5161
SMILESCOc1ccc2nc(-c3ccc(OC4CCN(CC4)C4CCC4)cc3)n(C)c(=O)c2c1