Reaction Details
TargetPotassium voltage-gated channel subfamily H member 2
LigandBDBM50246331
Substrate/Competitorn/a
Meas. Tech.ChEMBL_558278 (CHEMBL956578)
IC50 2900±n/a nM
Citation Mizutani, TNagase, TIto, SMiyamoto, YTanaka, TTakenaga, NTokita, SSato, N Development of novel 2-[4-(aminoalkoxy)phenyl]-4(3H)-quinazolinone derivatives as potent and selective histamine H3 receptor inverse agonists. Bioorg Med Chem Lett18:6041-5 (2008) 
 
Potassium voltage-gated channel subfamily H member 2
Name:Potassium voltage-gated channel subfamily H member 2
Type:Multi-pass membrane protein
Mol. Mass.:126672.65
Organism:Homo sapiens (Human)
Description:Q12809
Residue:1159
BDBM50246331
NameBDBM50246331
Synonyms:2-(4-(1-cyclopentylpiperidin-4-yloxy)phenyl)-3-methylquinazolin-4(3H)-one | CHEMBL455681
TypeSmall organic molecule
Emp. Form.C25H29N3O2
Mol. Mass.403.5167
SMILESCn1c(nc2ccccc2c1=O)-c1ccc(OC2CCN(CC2)C2CCCC2)cc1