Reaction Details
TargetAlpha-1A adrenergic receptor
LigandBDBM50246289
Substrate/Competitorn/a
Meas. Tech.ChEMBL_558279 (CHEMBL956579)
IC50 2200±n/a nM
Citation Mizutani, TNagase, TIto, SMiyamoto, YTanaka, TTakenaga, NTokita, SSato, N Development of novel 2-[4-(aminoalkoxy)phenyl]-4(3H)-quinazolinone derivatives as potent and selective histamine H3 receptor inverse agonists. Bioorg Med Chem Lett18:6041-5 (2008) 
 
Alpha-1A adrenergic receptor
Name:Alpha-1A adrenergic receptor
Type:Cell-surface receptors
Mol. Mass.:51511.67
Organism:Homo sapiens (Human)
Description:P35348
Residue:466
BDBM50246289
NameBDBM50246289
Synonyms:3-methyl-2-(4-(3-(pyrrolidin-1-yl)propoxy)phenyl)quinazolin-4(3H)-one CHEMBL557214
TypeSmall organic molecule
Emp. Form.C22H25N3O2
Mol. Mass.363.4528
SMILESCn1c(nc2ccccc2c1=O)-c1ccc(OCCCN2CCCC2)cc1