Reaction Details
TargetHistamine H1 receptor
LigandBDBM50246435
Substrate/Competitorn/a
Meas. Tech.ChEMBL_558280 (CHEMBL956580)
IC50>10000±n/a nM
Citation Mizutani, TNagase, TIto, SMiyamoto, YTanaka, TTakenaga, NTokita, SSato, N Development of novel 2-[4-(aminoalkoxy)phenyl]-4(3H)-quinazolinone derivatives as potent and selective histamine H3 receptor inverse agonists. Bioorg Med Chem Lett18:6041-5 (2008) 
 
Histamine H1 receptor
Name:Histamine H1 receptor
Type:G Protein-Coupled Receptor (GPCR)
Mol. Mass.:55808.72
Organism:Homo sapiens (Human)
Description:Cell pellets from SK-N-MC cells transfected with human H1 receptor were used in binding assay.
Residue:487
BDBM50246435
NameBDBM50246435
Synonyms:2-(4-(1-cyclobutylpiperidin-4-yloxy)phenyl)-8-methoxy-3-methylpyrido[3,4-d]pyrimidin-4(3H)-one | CHEMBL507360
TypeSmall organic molecule
Emp. Form.C24H28N4O3
Mol. Mass.420.5041
SMILESCOc1nccc2c1nc(-c1ccc(OC3CCN(CC3)C3CCC3)cc1)n(C)c2=O