Reaction Details
TargetPeptidylglycine alpha-amidating monooxygenase
LigandBDBM50273962
Substrate/Competitorn/a
Meas. Tech.ChEMBL_536304 (CHEMBL990738)
Ki 3800000±n/a nM
Citation Merkler, DJAsser, ASBaumgart, LECarballo, NCarpenter, SEChew, GHCosner, CCDusi, JGalloway, LCLowe, ABLowe, EWKing, LKendig, RDKline, PCMalka, RMerkler, KAMcIntyre, NRRomero, MWilcox, BJOwen, TC Substituted hippurates and hippurate analogs as substrates and inhibitors of peptidylglycine alpha-hydroxylating monooxygenase (PHM). Bioorg Med Chem16:10061-74 (2008) 
 
Peptidylglycine alpha-amidating monooxygenase
Name:Peptidylglycine alpha-amidating monooxygenase
Type:PROTEIN
Mol. Mass.:108665.78
Organism:Rattus norvegicus
Description:ChEMBL_536304
Residue:976
BDBM50273962
NameBDBM50273962
Synonyms:CHEMBL445286 | Phenylthioacetylglycine
TypeSmall organic molecule
Emp. Form.C10H11NO2S
Mol. Mass.209.265
SMILESOC(=O)CNC(=S)Cc1ccccc1