Reaction Details
TargetATP-dependent translocase ABCB1
LigandBDBM50275947
Substrate/Competitorn/a
Meas. Tech.ChEMBL_493332 (CHEMBL952395)
Ki 420±n/a nM
Citation Jiménez-Alonso, SPérez-Lomas, ALEstévez-Braun, AMuñoz Martinez, FChávez Orellana, HRavelo, AGGamarro, FCastanys, SLópez, M Bis-pyranobenzoquinones as a new family of reversal agents of the multidrug resistance phenotype mediated by P-glycoprotein in mammalian cells and the protozoan parasite Leishmania. J Med Chem51:7132-43 (2009) 
 
ATP-dependent translocase ABCB1
Name:ATP-dependent translocase ABCB1
Type:Protein
Mol. Mass.:141503.50
Organism:Homo sapiens (Human)
Description:P08183
Residue:1280
BDBM50275947
NameBDBM50275947
Synonyms:(5S,14R,19S,28R)-10,23-dimethoxy-4,4,29,29-tetramethyl-3,7,26,30-tetraoxaheptacyclo[16.12.0.0^{2,15}.0^{5,14}.0^{8,13}.0^{19,28}.0^{20,25}]triaconta-1(18),2(15),8(13),9,11,20(25),21,23-octaene-16,17-dione | CHEMBL1
TypeSmall organic molecule
Emp. Form.C32H32O8
Mol. Mass.544.5917
SMILESCOc1ccc2[C@H]3[C@@H](COc2c1)C(C)(C)OC1=C3C(=O)C(=O)C2=C1OC(C)(C)[C@H]1COc3cc(OC)ccc3[C@@H]21