Reaction Details
TargetSodium-dependent dopamine transporter
LigandBDBM50274951
Substrate/Competitorn/a
Meas. Tech.ChEMBL_493417 (CHEMBL944374)
Ki 10±n/a nM
Citation Bannwart, LMCarter, DSCai, HYChoy, JCGreenhouse, RJaime-Figueroa, SIyer, PSLin, CJLee, EKLucas, MCLynch, SMMadera, AMMoore, AOzboya, KRaptova, LRoetz, RSchoenfeld, RCStein, KASteiner, SVilla, MWeikert, RJZhai, Y Novel 3,3-disubstituted pyrrolidines as selective triple serotonin/norepinephrine/dopamine reuptake inhibitors. Bioorg Med Chem Lett18:6062-6 (2008) 
 
Sodium-dependent dopamine transporter
Name:Sodium-dependent dopamine transporter
Type:Multi-pass membrane protein
Mol. Mass.:68497.11
Organism:Homo sapiens (Human)
Description:Q01959
Residue:620
BDBM50274951
NameBDBM50274951
Synonyms:5-(3-benzylpyrrolidin-3-yl)-1-methyl-1H-indole | CHEMBL459176
TypeSmall organic molecule
Emp. Form.C20H22N2
Mol. Mass.290.4021
SMILESCn1ccc2cc(ccc12)C1(Cc2ccccc2)CCNC1