Reaction Details
TargetSodium-dependent dopamine transporter
LigandBDBM50275439
Substrate/Competitorn/a
Meas. Tech.ChEMBL_493417 (CHEMBL944374)
Ki 115±n/a nM
Citation Bannwart, LMCarter, DSCai, HYChoy, JCGreenhouse, RJaime-Figueroa, SIyer, PSLin, CJLee, EKLucas, MCLynch, SMMadera, AMMoore, AOzboya, KRaptova, LRoetz, RSchoenfeld, RCStein, KASteiner, SVilla, MWeikert, RJZhai, Y Novel 3,3-disubstituted pyrrolidines as selective triple serotonin/norepinephrine/dopamine reuptake inhibitors. Bioorg Med Chem Lett18:6062-6 (2008) 
 
Sodium-dependent dopamine transporter
Name:Sodium-dependent dopamine transporter
Type:Multi-pass membrane protein
Mol. Mass.:68497.11
Organism:Homo sapiens (Human)
Description:Q01959
Residue:620
BDBM50275439
NameBDBM50275439
Synonyms:5-(3-benzylpyrrolidin-3-yl)-1H-indazole | CHEMBL520869
TypeSmall organic molecule
Emp. Form.C18H19N3
Mol. Mass.277.3636
SMILESC(c1ccccc1)C1(CCNC1)c1ccc2[nH]ncc2c1