Reaction Details
TargetCytochrome P450 2D6
LigandBDBM50274954
Substrate/Competitorn/a
Meas. Tech.ChEMBL_493419 (CHEMBL944376)
IC50 4100±n/a nM
Citation Bannwart, LMCarter, DSCai, HYChoy, JCGreenhouse, RJaime-Figueroa, SIyer, PSLin, CJLee, EKLucas, MCLynch, SMMadera, AMMoore, AOzboya, KRaptova, LRoetz, RSchoenfeld, RCStein, KASteiner, SVilla, MWeikert, RJZhai, Y Novel 3,3-disubstituted pyrrolidines as selective triple serotonin/norepinephrine/dopamine reuptake inhibitors. Bioorg Med Chem Lett18:6062-6 (2008) 
 
Cytochrome P450 2D6
Name:Cytochrome P450 2D6
Type:Protein
Mol. Mass.:55774.82
Organism:Homo sapiens (Human)
Description:P10635
Residue:497
BDBM50274954
NameBDBM50274954
Synonyms:5-(3-benzylpyrrolidin-3-yl)-1H-indole-2-carboxamide | CHEMBL457931
TypeSmall organic molecule
Emp. Form.C20H21N3O
Mol. Mass.319.4002
SMILESNC(=O)c1cc2cc(ccc2[nH]1)C1(Cc2ccccc2)CCNC1