Reaction Details
TargetCytochrome P450 2D6
LigandBDBM50275438
Substrate/Competitorn/a
Meas. Tech.ChEMBL_493419 (CHEMBL944376)
IC50 3100±n/a nM
Citation Bannwart, LMCarter, DSCai, HYChoy, JCGreenhouse, RJaime-Figueroa, SIyer, PSLin, CJLee, EKLucas, MCLynch, SMMadera, AMMoore, AOzboya, KRaptova, LRoetz, RSchoenfeld, RCStein, KASteiner, SVilla, MWeikert, RJZhai, Y Novel 3,3-disubstituted pyrrolidines as selective triple serotonin/norepinephrine/dopamine reuptake inhibitors. Bioorg Med Chem Lett18:6062-6 (2008) 
 
Cytochrome P450 2D6
Name:Cytochrome P450 2D6
Type:Protein
Mol. Mass.:55774.82
Organism:Homo sapiens (Human)
Description:P10635
Residue:497
BDBM50275438
NameBDBM50275438
Synonyms:(+)-5-(3-benzylpyrrolidin-3-yl)-1H-indole 5-(3-BENZYLPYRROLIDIN-3-YL)-1H-INDOLE (STRUCTURAL MIX) CHEMBL487355
TypeSmall organic molecule
Emp. Form.C19H20N2
Mol. Mass.276.3755
SMILESC(c1ccccc1)C1(CCNC1)c1ccc2[nH]ccc2c1