Reaction Details
TargetThyroid hormone receptor alpha
LigandBDBM50275257
Substrate/Competitorn/a
Meas. Tech.ChEMBL_493724 (CHEMBL949479)
Ki 30.5±n/a nM
Citation Boyer, SHJiang, HJacintho, JDReddy, MVLi, HLi, WGodwin, JLSchulz, WGCable, EEHou, JWu, RFujitaki, JMHecker, SJErion, MD Synthesis and biological evaluation of a series of liver-selective phosphonic acid thyroid hormone receptor agonists and their prodrugs. J Med Chem51:7075-93 (2009) 
 
Thyroid hormone receptor alpha
Name:Thyroid hormone receptor alpha
Type:Receptor
Mol. Mass.:54818.00
Organism:Homo sapiens (Human)
Description:Recombinant hThR was obtained from nuclear extracts from SF9 cells infected with baculovirus vectors encoding for ThRalpha 1.
Residue:490
BDBM50275257
NameBDBM50275257
Synonyms:CHEMBL448595 | [3,5-Dimethyl-4-(3'-sec-butyl-4'-hydroxybenzyl)phenoxy]methylphosphonicAcid
TypeSmall organic molecule
Emp. Form.C20H27O5P
Mol. Mass.378.3991
SMILESCCC(C)c1cc(Cc2c(C)cc(OCP(O)(O)=O)cc2C)ccc1O