Reaction Details
TargetThyroid hormone receptor alpha
LigandBDBM50275291
Substrate/Competitorn/a
Meas. Tech.ChEMBL_493724 (CHEMBL949479)
Ki 28.4±n/a nM
Citation Boyer, SHJiang, HJacintho, JDReddy, MVLi, HLi, WGodwin, JLSchulz, WGCable, EEHou, JWu, RFujitaki, JMHecker, SJErion, MD Synthesis and biological evaluation of a series of liver-selective phosphonic acid thyroid hormone receptor agonists and their prodrugs. J Med Chem51:7075-93 (2009) 
 
Thyroid hormone receptor alpha
Name:Thyroid hormone receptor alpha
Type:Receptor
Mol. Mass.:54818.00
Organism:Homo sapiens (Human)
Description:Recombinant hThR was obtained from nuclear extracts from SF9 cells infected with baculovirus vectors encoding for ThRalpha 1.
Residue:490
BDBM50275291
NameBDBM50275291
Synonyms:CHEMBL485758 | [4-(4'-Hydroxy-3'-isopropylbenzyl)-3,5-dimethylphenylamino]methylphosphonicAcid
TypeSmall organic molecule
Emp. Form.C19H26NO4P
Mol. Mass.363.3878
SMILESCC(C)c1cc(Cc2c(C)cc(NCP(O)(O)=O)cc2C)ccc1O