Reaction Details
TargetThyroid hormone receptor alpha
LigandBDBM50275293
Substrate/Competitorn/a
Meas. Tech.ChEMBL_493724 (CHEMBL949479)
Ki 303±n/a nM
Citation Boyer, SHJiang, HJacintho, JDReddy, MVLi, HLi, WGodwin, JLSchulz, WGCable, EEHou, JWu, RFujitaki, JMHecker, SJErion, MD Synthesis and biological evaluation of a series of liver-selective phosphonic acid thyroid hormone receptor agonists and their prodrugs. J Med Chem51:7075-93 (2009) 
 
Thyroid hormone receptor alpha
Name:Thyroid hormone receptor alpha
Type:Receptor
Mol. Mass.:54818.00
Organism:Homo sapiens (Human)
Description:Recombinant hThR was obtained from nuclear extracts from SF9 cells infected with baculovirus vectors encoding for ThRalpha 1.
Residue:490
BDBM50275293
NameBDBM50275293
Synonyms:CHEMBL486358 | [3,5-Dichloro-4-(4'-hydroxy-3'-isopropylphenoxy)]benzylphosphonicAcid
TypeSmall organic molecule
Emp. Form.C16H17Cl2O5P
Mol. Mass.391.183
SMILESCC(C)c1cc(Oc2c(Cl)cc(CP(O)(O)=O)cc2Cl)ccc1O