Reaction Details
TargetThyroid hormone receptor alpha
LigandBDBM50274813
Substrate/Competitorn/a
Meas. Tech.ChEMBL_493724 (CHEMBL949479)
Ki 183±n/a nM
Citation Boyer, SHJiang, HJacintho, JDReddy, MVLi, HLi, WGodwin, JLSchulz, WGCable, EEHou, JWu, RFujitaki, JMHecker, SJErion, MD Synthesis and biological evaluation of a series of liver-selective phosphonic acid thyroid hormone receptor agonists and their prodrugs. J Med Chem51:7075-93 (2009) 
 
Thyroid hormone receptor alpha
Name:Thyroid hormone receptor alpha
Type:Receptor
Mol. Mass.:54818.00
Organism:Homo sapiens (Human)
Description:Recombinant hThR was obtained from nuclear extracts from SF9 cells infected with baculovirus vectors encoding for ThRalpha 1.
Residue:490
BDBM50274813
NameBDBM50274813
Synonyms:CHEMBL457529 | [3,5-Dimethyl-4-(4'-hydroxy-3'-isopropylphenoxy)phenoxy]methylphosphonicAcid
TypeSmall organic molecule
Emp. Form.C18H23O6P
Mol. Mass.366.3454
SMILESCC(C)c1cc(Oc2c(C)cc(OCP(O)(O)=O)cc2C)ccc1O