Reaction Details
TargetEnvelope glycoprotein gp70
LigandBDBM50273851
Substrate/Competitorn/a
Meas. Tech.ChEMBL_536775 (CHEMBL984569)
IC50 6800±n/a nM
Citation LaFrate, ALGunther, JRCarlson, KEKatzenellenbogen, JA Synthesis and biological evaluation of guanylhydrazone coactivator binding inhibitors for the estrogen receptor. Bioorg Med Chem16:10075-84 (2008) 
 
Envelope glycoprotein gp70
Name:Envelope glycoprotein gp70
Type:PROTEIN
Mol. Mass.:77236.72
Organism:Mouse mammary tumor virus (strain GR) (MMTV)
Description:ChEMBL_536775
Residue:688
BDBM50273851
NameBDBM50273851
Synonyms:2-[(3-chloro-1H-inden-2-yl)methylene]hydrazinecarboximidamide | CHEMBL456598
TypeSmall organic molecule
Emp. Form.C11H11ClN4
Mol. Mass.234.685
SMILES[#7]\[#6](-[#7])=[#7]\[#7]=[#6]-[#6]-1=[#6](Cl)-c2ccccc2-[#6]-1