Reaction Details
TargetCannabinoid receptor 1
LigandBDBM50256316
Substrate/Competitorn/a
Meas. Tech.ChEMBL_519285 (CHEMBL947737)
Ki 152±n/a nM
Citation Kai, HMorioka, YKoriyama, YOkamoto, KHasegawa, YHattori, MKoike, KChiba, HShinohara, SIwamoto, YTakahashi, KTanimoto, N 2-Arylimino-5,6-dihydro-4H-1,3-thiazines as a new class of cannabinoid receptor agonists. Part 3: Synthesis and activity of isosteric analogs. Bioorg Med Chem Lett18:6444-7 (2008) 
 
Cannabinoid receptor 1
Name:Cannabinoid receptor 1
Type:G Protein-Coupled Receptor (GPCR)
Mol. Mass.:52868.96
Organism:Homo sapiens (Human)
Description:P21554
Residue:472
BDBM50256316
NameBDBM50256316
Synonyms:CHEMBL469896 | methyl 3-(benzo[c][1,2,5]oxadiazol-4-ylimino)-2-oxa-4-azaspiro[5.5]undecane-4-carbodithioate
TypeSmall organic molecule
Emp. Form.C17H20N4O2S2
Mol. Mass.376.496
SMILESCSC(=S)N1CC2(CCCCC2)CO\C1=N/c1cccc2nonc12