Reaction Details
TargetCannabinoid receptor 1
LigandBDBM50256431
Substrate/Competitorn/a
Meas. Tech.ChEMBL_519285 (CHEMBL947737)
Ki 14±n/a nM
Citation Kai, HMorioka, YKoriyama, YOkamoto, KHasegawa, YHattori, MKoike, KChiba, HShinohara, SIwamoto, YTakahashi, KTanimoto, N 2-Arylimino-5,6-dihydro-4H-1,3-thiazines as a new class of cannabinoid receptor agonists. Part 3: Synthesis and activity of isosteric analogs. Bioorg Med Chem Lett18:6444-7 (2008) 
 
Cannabinoid receptor 1
Name:Cannabinoid receptor 1
Type:G Protein-Coupled Receptor (GPCR)
Mol. Mass.:52868.96
Organism:Homo sapiens (Human)
Description:P21554
Residue:472
BDBM50256431
NameBDBM50256431
Synonyms:CHEMBL480578 | methyl 3-(5,6,7,8-tetrahydronaphthalen-1-ylimino)-2-oxa-4-azaspiro[5.5]undecane-4-carbodithioate
TypeSmall organic molecule
Emp. Form.C21H28N2OS2
Mol. Mass.388.59
SMILESCSC(=S)N1CC2(CCCCC2)CO\C1=N/c1cccc2CCCCc12