Reaction Details
TargetCannabinoid receptor 2
LigandBDBM50256377
Substrate/Competitorn/a
Meas. Tech.ChEMBL_519287 (CHEMBL947739)
Ki 4.7±n/a nM
Citation Kai, HMorioka, YKoriyama, YOkamoto, KHasegawa, YHattori, MKoike, KChiba, HShinohara, SIwamoto, YTakahashi, KTanimoto, N 2-Arylimino-5,6-dihydro-4H-1,3-thiazines as a new class of cannabinoid receptor agonists. Part 3: Synthesis and activity of isosteric analogs. Bioorg Med Chem Lett18:6444-7 (2008) 
 
Cannabinoid receptor 2
Name:Cannabinoid receptor 2
Type:G Protein-Coupled Receptor (GPCR)
Mol. Mass.:39690.94
Organism:Homo sapiens (Human)
Description:P34972
Residue:360
BDBM50256377
NameBDBM50256377
Synonyms:CHEMBL449624 | methyl 3-(5-tert-butylisoxazol-3-ylimino)-2-oxa-4-azaspiro[5.5]undecane-4-carbodithioate
TypeSmall organic molecule
Emp. Form.C18H27N3O2S2
Mol. Mass.381.556
SMILESCSC(=S)N1CC2(CCCCC2)CO\C1=N/c1cc(on1)C(C)(C)C