Reaction Details
TargetTyrosine-protein kinase Lck
LigandBDBM50198370
Substrate/Competitorn/a
Meas. Tech.ChEMBL_558903 (CHEMBL1022582)
IC50 20±n/a nM
Citation Ozawa, TTsuji, EOzawa, MHanda, CMukaiyama, HNishimura, TKobayashi, SOkazaki, K The importance of CH/pi hydrogen bonds in rational drug design: An ab initio fragment molecular orbital study to leukocyte-specific protein tyrosine (LCK) kinase. Bioorg Med Chem16:10311-8 (2008) 
 
Tyrosine-protein kinase Lck
Name:Tyrosine-protein kinase Lck
Type:n/a
Mol. Mass.:57987.83
Organism:Homo sapiens (Human)
Description:P06239
Residue:509
BDBM50198370
NameBDBM50198370
Synonyms:CHEMBL223873 N-(2,6-dimethylphenyl)-5-phenylimidazo[1,5-a]pyrazin-8-amine | N-(2,6-dimethylphenyl)-5-phenylimidazo[1,5-a]pyrazine-8-amine
TypeSmall organic molecule
Emp. Form.C20H18N4
Mol. Mass.314.3837
SMILESCc1cccc(C)c1Nc1ncc(-c2ccccc2)n2cncc12