Reaction Details
TargetHydroxycarboxylic acid receptor 2
LigandBDBM50216551
Substrate/Competitorn/a
Meas. Tech.ChEMBL_536825 (CHEMBL988089)
Ki 72±n/a nM
Citation Boatman, PDRichman, JGSemple, G Nicotinic acid receptor agonists. J Med Chem51:7653-62 (2008) 
 
Hydroxycarboxylic acid receptor 2
Name:Hydroxycarboxylic acid receptor 2
Type:G Protein-Coupled Receptor (GPCR)
Mol. Mass.:41868.22
Organism:Homo sapiens (Human)
Description:Membranes from CHO cells expressing the recombinant human GPR109A were used in competition binding assay.
Residue:363
BDBM50216551
NameBDBM50216551
Synonyms:3-pentyl-1H-pyrazole-5-carboxylic acid 5-pentyl-1H-pyrazole-3-carboxylic acid | CHEMBL247921
TypeSmall organic molecule
Emp. Form.C9H14N2O2
Mol. Mass.182.2197
SMILESCCCCCc1cc(n[nH]1)C(O)=O