Reaction Details
TargetCyclin-dependent kinase 2
LigandBDBM50246298
Substrate/Competitorn/a
Meas. Tech.ChEMBL_558912 (CHEMBL1022591)
IC50 2±n/a nM
Citation Jones, CDAndrews, DMBarker, AJBlades, KByth, KFFinlay, MRGeh, CGreen, CPJohannsen, MWalker, MWeir, HM Imidazole pyrimidine amides as potent, orally bioavailable cyclin-dependent kinase inhibitors. Bioorg Med Chem Lett18:6486-9 (2008) 
 
Cyclin-dependent kinase 2
Name:Cyclin-dependent kinase 2
Type:Enzyme Subunit
Mol. Mass.:33938.17
Organism:Homo sapiens (Human)
Description:P24941
Residue:298
BDBM50246298
NameBDBM50246298
Synonyms:CHEMBL487067 | N-(2-hydroxyethyl)-4-(4-(1-isopropyl-2-methyl-1H-imidazol-5-yl)pyrimidin-2-ylamino)benzamide
TypeSmall organic molecule
Emp. Form.C20H24N6O2
Mol. Mass.380.4436
SMILESCC(C)n1c(C)ncc1-c1ccnc(Nc2ccc(cc2)C(=O)NCCO)n1