Reaction Details
TargetCyclin-dependent kinase 2
LigandBDBM50246447
Substrate/Competitorn/a
Meas. Tech.ChEMBL_558912 (CHEMBL1022591)
IC50 2±n/a nM
Citation Jones, CDAndrews, DMBarker, AJBlades, KByth, KFFinlay, MRGeh, CGreen, CPJohannsen, MWalker, MWeir, HM Imidazole pyrimidine amides as potent, orally bioavailable cyclin-dependent kinase inhibitors. Bioorg Med Chem Lett18:6486-9 (2008) 
 
Cyclin-dependent kinase 2
Name:Cyclin-dependent kinase 2
Type:Enzyme Subunit
Mol. Mass.:33938.17
Organism:Homo sapiens (Human)
Description:P24941
Residue:298
BDBM50246447
NameBDBM50246447
Synonyms:2-fluoro-4-(5-fluoro-4-(1-isopropyl-2-methyl-1H-imidazol-5-yl)pyrimidin-2-ylamino)-N,N-dimethylbenzamide | CHEMBL454648
TypeSmall organic molecule
Emp. Form.C20H22F2N6O
Mol. Mass.400.4251
SMILESCC(C)n1c(C)ncc1-c1nc(Nc2ccc(C(=O)N(C)C)c(F)c2)ncc1F