Reaction Details
TargetFibroblast growth factor receptor 1
LigandBDBM50246396
Substrate/Competitorn/a
Meas. Tech.ChEMBL_558925 (CHEMBL1009271)
IC50>10000±n/a nM
Citation Jones, CDAndrews, DMBarker, AJBlades, KByth, KFFinlay, MRGeh, CGreen, CPJohannsen, MWalker, MWeir, HM Imidazole pyrimidine amides as potent, orally bioavailable cyclin-dependent kinase inhibitors. Bioorg Med Chem Lett18:6486-9 (2008) 
 
Fibroblast growth factor receptor 1
Name:Fibroblast growth factor receptor 1
Type:Receptor
Mol. Mass.:91861.70
Organism:Homo sapiens (Human)
Description:P11362
Residue:822
BDBM50246396
NameBDBM50246396
Synonyms:2-fluoro-4-(4-(1-isopropyl-2-methyl-1H-imidazol-5-yl)pyrimidin-2-ylamino)-N-methylbenzamide | CHEMBL455428
TypeSmall organic molecule
Emp. Form.C19H21FN6O
Mol. Mass.368.408
SMILESCNC(=O)c1ccc(Nc2nccc(n2)-c2cnc(C)n2C(C)C)cc1F