Reaction Details
TargetTyrosine-protein kinase JAK2
LigandBDBM50246396
Substrate/Competitorn/a
Meas. Tech.ChEMBL_558927 (CHEMBL1009273)
IC50>10000±n/a nM
Citation Jones, CDAndrews, DMBarker, AJBlades, KByth, KFFinlay, MRGeh, CGreen, CPJohannsen, MWalker, MWeir, HM Imidazole pyrimidine amides as potent, orally bioavailable cyclin-dependent kinase inhibitors. Bioorg Med Chem Lett18:6486-9 (2008) 
 
Tyrosine-protein kinase JAK2
Name:Tyrosine-protein kinase JAK2
Type:Protein
Mol. Mass.:130684.68
Organism:Homo sapiens (Human)
Description:O60674
Residue:1132
BDBM50246396
NameBDBM50246396
Synonyms:2-fluoro-4-(4-(1-isopropyl-2-methyl-1H-imidazol-5-yl)pyrimidin-2-ylamino)-N-methylbenzamide | CHEMBL455428
TypeSmall organic molecule
Emp. Form.C19H21FN6O
Mol. Mass.368.408
SMILESCNC(=O)c1ccc(Nc2nccc(n2)-c2cnc(C)n2C(C)C)cc1F