Reaction Details
TargetConcanavalin-A
LigandBDBM50246209
Substrate/Competitorn/a
Meas. Tech.ChEMBL_559137 (CHEMBL1012082)
IC50 234000±n/a nM
Citation Welch, KTTurner, TAPreast, CE Rational design of novel glycomimetics: inhibitors of concanavalin A. Bioorg Med Chem Lett18:6573-5 (2008) 
 
Concanavalin-A
Name:Concanavalin-A
Synonyms:CONA_CANEN
Type:PROTEIN
Mol. Mass.:31477.03
Organism:Canavalia ensiformis
Description:ChEMBL_559137
Residue:290
BDBM50246209
NameBDBM50246209
TypeSmall organic molecule
Emp. Form.C11H10N4O3S
Mol. Mass.278.287
SMILESNS(=O)(=O)c1ccc(cc1)N=Nc1ccc[nH]c1=O