Reaction Details
TargetConcanavalin-A
LigandBDBM50246257
Substrate/Competitorn/a
Meas. Tech.ChEMBL_559137 (CHEMBL1012082)
IC50 615000±n/a nM
Citation Welch, KTTurner, TAPreast, CE Rational design of novel glycomimetics: inhibitors of concanavalin A. Bioorg Med Chem Lett18:6573-5 (2008) 
 
Concanavalin-A
Name:Concanavalin-A
Synonyms:CONA_CANEN
Type:PROTEIN
Mol. Mass.:31477.03
Organism:Canavalia ensiformis
Description:ChEMBL_559137
Residue:290
BDBM50246257
NameBDBM50246257
TypeSmall organic molecule
Emp. Form.C11H9N7O4S
Mol. Mass.335.299
SMILESNS(=O)(=O)c1ccc(cc1)N=Nc1nc2[nH]c(=O)[nH]c(=O)c2[nH]1