Reaction Details
TargetConcanavalin-A
LigandBDBM50166886
Substrate/Competitorn/a
Meas. Tech.ChEMBL_559137 (CHEMBL1012082)
IC50 350000±n/a nM
Citation Welch, KTTurner, TAPreast, CE Rational design of novel glycomimetics: inhibitors of concanavalin A. Bioorg Med Chem Lett18:6573-5 (2008) 
 
Concanavalin-A
Name:Concanavalin-A
Synonyms:CONA_CANEN
Type:PROTEIN
Mol. Mass.:31477.03
Organism:Canavalia ensiformis
Description:ChEMBL_559137
Residue:290
BDBM50166886
NameBDBM50166886
TypeSmall organic molecule
Emp. Form.C7H14O6
Mol. Mass.194.1825
SMILESCO[C@H]1O[C@H](CO)[C@@H](O)[C@H](O)[C@@H]1O