Reaction Details
TargetNociceptin receptor
LigandBDBM50245891
Substrate/Competitorn/a
Meas. Tech.ChEMBL_559149 (CHEMBL1012094)
Ki 4±n/a nM
Citation Yang, SWHo, GTulshian, DGreenlee, WJFernandez, XMcLeod, RLEckel, SAnthes, J Structure-activity relationships of 3-substituted N-benzhydryl-nortropane analogs as nociceptin receptor ligands for the treatment of cough. Bioorg Med Chem Lett18:6340-3 (2008) 
 
Nociceptin receptor
Name:Nociceptin receptor
Type:G Protein-Coupled Receptor (GPCR)
Mol. Mass.:40702.87
Organism:Homo sapiens (Human)
Description:P41146
Residue:370
BDBM50245891
NameBDBM50245891
Synonyms:(rel)-N-((8-(bis(2-chlorophenyl)methyl)-3-(6-methoxypyridin-2-yl)-8-aza-bicyclo[3.2.1]octan-3-yl)methyl)acetamide | CHEMBL516801
TypeSmall organic molecule
Emp. Form.C29H31Cl2N3O2
Mol. Mass.524.481
SMILESCOc1cccc(n1)C1(CNC(C)=O)C[C@@H]2CC[C@@H](C1)N2C(c1ccccc1Cl)c1ccccc1Cl