Reaction Details
TargetSodium-dependent serotonin transporter
LigandBDBM50279541
Substrate/Competitorn/a
Meas. Tech.ChEMBL_522451 (CHEMBL1001584)
Ki 0.7±n/a nM
Citation Herold, FChodkowski, AIzbicki, LKról, MKleps, JTurlo, JNowak, GStachowicz, KDybala, MSiwek, A Novel 4-aryl-pyrido[1,2-c]pyrimidines with dual SSRI and 5-HT1A activity, part 1. Eur J Med Chem44:1710-7 (2009) 
 
Sodium-dependent serotonin transporter
Name:Sodium-dependent serotonin transporter
Type:Multi-pass membrane protein
Mol. Mass.:70168.43
Organism:Rattus norvegicus (rat)
Description:P31652
Residue:630
BDBM50279541
NameBDBM50279541
Synonyms:2-(4-(4-(1H-indol-3-yl)piperidin-1-yl)butyl)-4-(2-fluorophenyl)-1H-pyrido[1,2-c]pyrimidine-1,3(2H)-dione | CHEMBL521496
TypeSmall organic molecule
Emp. Form.C31H31FN4O2
Mol. Mass.510.6018
SMILESFc1ccccc1-c1c2ccccn2c(=O)n(CCCCN2CCC(CC2)c2c[nH]c3ccccc23)c1=O