Reaction Details
TargetFe(3+)-Zn(2+) purple acid phosphatase
LigandBDBM50080269
Substrate/Competitorn/a
Meas. Tech.ChEMBL_560427 (CHEMBL1015430)
pH6.2±n/a
IC50>7000000±n/a nM
Commentsextracted
Citation McGeary, RPVella, PMak, JYGuddat, LWSchenk, G Inhibition of purple acid phosphatase with alpha-alkoxynaphthylmethylphosphonic acids. Bioorg Med Chem Lett19:163-6 (2008) 
 
Fe(3+)-Zn(2+) purple acid phosphatase
Name:Fe(3+)-Zn(2+) purple acid phosphatase
Type:PROTEIN
Mol. Mass.:52875.57
Organism:Phaseolus vulgaris
Description:ChEMBL_560427
Residue:459
BDBM50080269
NameBDBM50080269
Synonyms:1-naphthalenemethylphosphonate Naphthalen-1-ylmethyl-phosphonic acid | naphthalen-1-ylmethylphosphonic acid
TypeSmall organic molecule
Emp. Form.C11H11O3P
Mol. Mass.222.177
SMILESOP(O)(=O)Cc1cccc2ccccc12