Reaction Details
TargetCannabinoid receptor 1
LigandBDBM50255081
Substrate/Competitorn/a
Meas. Tech.ChEMBL_558495 (CHEMBL963901)
IC50 39.4±n/a nM
Citation Kim, JYSeo, HJLee, SHJung, MEAhn, KKim, JLee, J Diarylimidazolyl oxadiazole and thiadiazole derivatives as cannabinoid CB1 receptor antagonists. Bioorg Med Chem Lett19:142-5 (2008) 
 
Cannabinoid receptor 1
Name:Cannabinoid receptor 1
Type:G Protein-Coupled Receptor (GPCR)
Mol. Mass.:52856.55
Organism:Rattus norvegicus (rat)
Description:P20272
Residue:473
BDBM50255081
NameBDBM50255081
Synonyms:2-(1-(4-chlorophenyl)-2-(2,4-dichlorophenyl)-5-methyl-1H-imidazol-4-yl)-5-isobutyl-1,3,4-oxadiazole | CHEMBL481979
TypeSmall organic molecule
Emp. Form.C22H19Cl3N4O
Mol. Mass.461.771
SMILESCC(C)Cc1nnc(o1)-c1nc(-c2ccc(Cl)cc2Cl)n(c1C)-c1ccc(Cl)cc1