Reaction Details
TargetCannabinoid receptor 1
LigandBDBM50254467
Substrate/Competitorn/a
Meas. Tech.ChEMBL_558495 (CHEMBL963901)
IC50 22.3±n/a nM
Citation Kim, JYSeo, HJLee, SHJung, MEAhn, KKim, JLee, J Diarylimidazolyl oxadiazole and thiadiazole derivatives as cannabinoid CB1 receptor antagonists. Bioorg Med Chem Lett19:142-5 (2008) 
 
Cannabinoid receptor 1
Name:Cannabinoid receptor 1
Type:G Protein-Coupled Receptor (GPCR)
Mol. Mass.:52856.55
Organism:Rattus norvegicus (rat)
Description:P20272
Residue:473
BDBM50254467
NameBDBM50254467
Synonyms:2-(1-(4-chlorophenyl)-2-(2,4-dichlorophenyl)-5-methyl-1H-imidazol-4-yl)-5-(pentan-3-yl)-1,3,4-oxadiazole | CHEMBL517576
TypeSmall organic molecule
Emp. Form.C23H21Cl3N4O
Mol. Mass.475.798
SMILESCCC(CC)c1nnc(o1)-c1nc(-c2ccc(Cl)cc2Cl)n(c1C)-c1ccc(Cl)cc1