Reaction Details
TargetCannabinoid receptor 1
LigandBDBM50255021
Substrate/Competitorn/a
Meas. Tech.ChEMBL_558495 (CHEMBL963901)
IC50 31.4±n/a nM
Citation Kim, JYSeo, HJLee, SHJung, MEAhn, KKim, JLee, J Diarylimidazolyl oxadiazole and thiadiazole derivatives as cannabinoid CB1 receptor antagonists. Bioorg Med Chem Lett19:142-5 (2008) 
 
Cannabinoid receptor 1
Name:Cannabinoid receptor 1
Type:G Protein-Coupled Receptor (GPCR)
Mol. Mass.:52856.55
Organism:Rattus norvegicus (rat)
Description:P20272
Residue:473
BDBM50255021
NameBDBM50255021
Synonyms:2-(1-(4-chlorophenyl)-2-(2,4-dichlorophenyl)-5-methyl-1H-imidazol-4-yl)-5-(1-phenylethyl)-1,3,4-oxadiazole | CHEMBL479615
TypeSmall organic molecule
Emp. Form.C26H19Cl3N4O
Mol. Mass.509.814
SMILESCC(c1nnc(o1)-c1nc(-c2ccc(Cl)cc2Cl)n(c1C)-c1ccc(Cl)cc1)c1ccccc1