Reaction Details
TargetCannabinoid receptor 1
LigandBDBM50254469
Substrate/Competitorn/a
Meas. Tech.ChEMBL_558495 (CHEMBL963901)
IC50 55.1±n/a nM
Citation Kim, JYSeo, HJLee, SHJung, MEAhn, KKim, JLee, J Diarylimidazolyl oxadiazole and thiadiazole derivatives as cannabinoid CB1 receptor antagonists. Bioorg Med Chem Lett19:142-5 (2008) 
 
Cannabinoid receptor 1
Name:Cannabinoid receptor 1
Type:G Protein-Coupled Receptor (GPCR)
Mol. Mass.:52856.55
Organism:Rattus norvegicus (rat)
Description:P20272
Residue:473
BDBM50254469
NameBDBM50254469
Synonyms:2-(1-(4-chlorophenyl)-2-(2,4-dichlorophenyl)-5-methyl-1H-imidazol-4-yl)-5-(1-(trifluoromethyl)cyclopropyl)-1,3,4-oxadiazole | CHEMBL459530
TypeSmall organic molecule
Emp. Form.C22H14Cl3F3N4O
Mol. Mass.513.727
SMILESCc1c(nc(-c2ccc(Cl)cc2Cl)n1-c1ccc(Cl)cc1)-c1nnc(o1)C1(CC1)C(F)(F)F